Home > Failed To > Failed To Archive Test Reports Hudson.util.ioexception2 Failed To Read

Failed To Archive Test Reports Hudson.util.ioexception2 Failed To Read

Nested exception: The value of attribute "name" associated with an element type "null" must not contain the '<' character. If you agree to our use of cookies, please close this message and continue to use this site. I'm not setting any specific version of ant or JUnit in the ant builder. Most times it builds ok anyway. check over here

at org.dom4j.io.SAXReader.read(SAXReader.java:482) at org.dom4j.io.SAXReader.read(SAXReader.java:264) at hudson.tasks.junit.SuiteResult.parse(SuiteResult.java:130) at hudson.tasks.junit.TestResult.parse(TestResult.java:274) at hudson.tasks.junit.TestResult.parsePossiblyEmpty(TestResult.java:230) at hudson.tasks.junit.TestResult.parse(TestResult.java:165) at hudson.tasks.junit.TestResult.parse(TestResult.java:148) at hudson.tasks.junit.TestResult.(TestResult.java:124) at hudson.tasks.junit.JUnitParser$ParseResultCallable.invoke(JUnitParser.java:117) at hudson.tasks.junit.JUnitParser$ParseResultCallable.invoke(JUnitParser.java:90) at hudson.FilePath$FileCallableWrapper.call(FilePath.java:2425) at hudson.remoting.UserRequest.perform(UserRequest.java:118) at hudson.remoting.UserRequest.perform(UserRequest.java:48) at hudson.remoting.Request$2.run(Request.java:328) at hudson.remoting.InterceptingExecutorService$1.call(InterceptingExecutorService.java:72) at Share Clone via HTTPS Clone with Git or checkout with SVN using the repository's web address. What's strange is that this only happens intermittently, and I've yet to find a conclusive pattern to the failures. {noformat} BUILD SUCCESSFUL Total time: 2 mins 35.991 secs Archiving artifacts Recording at org.dom4j.io.SAXReader.read(SAXReader.java:484) at org.dom4j.io.SAXReader.read(SAXReader.java:264) at hudson.tasks.junit.SuiteResult.parse(SuiteResult.java:101) at hudson.tasks.junit.TestResult.parse(TestResult.java:200) ... 19 more Caused by: com.sun.org.apache.xerces.internal.impl.io.MalformedByteSequenceException: Invalid byte 1 of 1-byte UTF-8 sequence.

at com.sun.org.apache.xerces.internal.util.ErrorHandlerWrapper.createSAXParseException() Java RT SAXParserImpl$JAXPSAXParser.parse com.sun.org.apache.xerces.internal.util.ErrorHandlerWrapper.createSAXParseException(Unknown Source) com.sun.org.apache.xerces.internal.util.ErrorHandlerWrapper.fatalError(Unknown Source) com.sun.org.apache.xerces.internal.impl.XMLErrorReporter.reportError(Unknown Source) com.sun.org.apache.xerces.internal.impl.XMLScanner.reportFatalError(Unknown Source) com.sun.org.apache.xerces.internal.impl.XMLDocumentFragmentScannerImpl.endEntity(Unknown Source) com.sun.org.apache.xerces.internal.impl.XMLDocumentScannerImpl.endEntity(Unknown Source) com.sun.org.apache.xerces.internal.impl.XMLEntityManager.endEntity(Unknown Source) com.sun.org.apache.xerces.internal.impl.XMLEntityScanner.load(Unknown Source) com.sun.org.apache.xerces.internal.impl.XMLEntityScanner.skipChar(Unknown Source) com.sun.org.apache.xerces.internal.impl.XMLDocumentFragmentScannerImpl$FragmentContentDriver.next(Unknown Source) com.sun.org.apache.xerces.internal.impl.XMLDocumentScannerImpl.next(Unknown Source) com.sun.org.apache.xerces.internal.impl.XMLNSDocumentScannerImpl.next(Unknown Source) com.sun.org.apache.xerces.internal.impl.XMLDocumentFragmentScannerImpl.scanDocument(Unknown Source) Comment 7 Mariela 2013-07-24 11:14:50 EDT (In reply to comment #4) > (In reply to comment #1) > > It may be useful the next time this happens to attach a Unfortunately the problem of xunit to deal with this report has an follow up problem: All other boost test result files are also not uploaded in my jenkins test results. 'E:\Jenkins\workspace' Automated exception search integrated into your IDE Test Samebug Integration for IntelliJ IDEA Root Cause Analysis org.xml.sax.SAXParseException XML document structures must start and end within the same entity.

Stack Overflow Meta Stack Overflow Stack Overflow Careers … Failed to archive test reports -- exception attempting to use SAX since 1.337. Total time: 0 seconds Recording test results ERROR: Failed to ar… current community. at com.sun.org.apache.xerces.internal.util.ErrorHandlerWrapper.createSAXParseException(Unknown Source) at com.sun.org.apache.xerces.internal.util.ErrorHandlerWrapper.fatalError(Unknown Source) at com.sun.org.apache.xerces.internal.impl.XMLErrorReporter.reportError(Unknown Source) at com.sun.org.apache.xerces.internal.impl.XMLScanner.reportFatalError(Unknown Source) at com.sun.org.apache.xerces.internal.impl.XMLDocumentFragmentScannerImpl.endEntity(Unknown Source) at com.sun.org.apache.xerces.internal.impl.XMLDocumentScannerImpl.endEntity(Unknown Source) at com.sun.org.apache.xerces.internal.impl.XMLEntityManager.endEntity(Unknown Source) at com.sun.org.apache.xerces.internal.impl.XMLEntityScanner.load(Unknown Source) at com.sun.org.apache.xerces.internal.impl.XMLEntityScanner.skipChar(Unknown Source) at com.sun.org.apache.xerces.internal.impl.XMLDocumentFragmentScannerImpl$FragmentContentDriver.next(Unknown Source) at Try JIRA - bug tracking software for your team.

Thread .run( Thread .java:595) Hide Permalink sbernaud added a comment - 2010/Jan/27 11:53 PM Problem solved by suppressing xercesImpl.jar from tomcat (v5.5) endorsed dir (/usr/share/tomcat5.5/common/endorsed/ for me). Try JIRA - bug tracking software for your team. DashboardsProjectsIssuesCaptureGetting started Help JIRA Core help Keyboard Shortcuts About JIRA JIRA Credits Log In Register for Jenkins World Join the Jenkins community at "Jenkins World" in Santa Clara, California from September Tyler Croy made changes - 2016/Jul/25 11:50 PM Workflow JNJira [ 150035 ] JNJira + In-Review [ 177540 ] People Assignee: Unassigned Reporter: Tom Denley Votes: 5 Vote for this issue

This is the error message as displayed in Console Output: Recording test results ERROR: Failed to archive test reports hudson.util.IOException2: remote file operation failed at hudson.FilePath.act(FilePath.java:672) at hudson.FilePath.act(FilePath.java:660) at hudson.tasks.junit.JUnitResultArchiver.perform(JUnitResultArchiver.java:117) at Publishing Doxygen skipped. Nested exception: The value of attribute "name" associated with an element type "null" must not contain the '<' character. Failed to read test report file /x/eng/rtpbld00/scratch/smo/.jenkins-ocf/workspace/ocf_main/modules/ocf-apihandler/target/reports/junit/IGNORETHIS.xml org.dom4j.DocumentException: Error on line 273 of document file:///x/eng/rtpbld00/scratch/smo/.jenkins-ocf/workspace/ocf_main/modules/ocf-apihandler/target/reports/junit/IGNORETHIS.xml : The value of attribute "name" associated with an element type "null" must not contain the

However I do not see that anyone has found the source of the problem, which is likely to be in the original writer of the file but could possibly occur in Finished: FAILURE And the corresponding node log : [12/16/09 12:59:34] [SSH] Checking java version of java [12/16/09 12:59:34] [SSH] java -version returned 1.6.0_12. [12/16/09 12:59:34] [SSH] Starting sftp client. [12/16/09 12:59:34] at com.sun.org.apache.xerces.internal.util.ErrorHandlerWrapper.createSAXParseException(ErrorHandlerWrapper.java:195) at com.sun.org.apache.xerces.internal.util.ErrorHandlerWrapper.fatalError(ErrorHandlerWrapper.java:174) at com.sun.org.apache.xerces.internal.impl.XMLErrorReporter.reportError(XMLErrorReporter.java:388) at com.sun.org.apache.xerces.internal.impl.XMLScanner.reportFatalError(XMLScanner.java:1414) at com.sun.org.apache.xerces.internal.impl.XMLScanner.scanAttributeValue(XMLScanner.java:932) at com.sun.org.apache.xerces.internal.impl.XMLNSDocumentScannerImpl.scanAttribute(XMLNSDocumentScannerImpl.java:460) at com.sun.org.apache.xerces.internal.impl.XMLNSDocumentScannerImpl.scanStartElement(XMLNSDocumentScannerImpl.java:277) at com.sun.org.apache.xerces.internal.impl.XMLDocumentFragmentScannerImpl$FragmentContentDriver.next(XMLDocumentFragmentScannerImpl.java:2755) at com.sun.org.apache.xerces.internal.impl.XMLDocumentScannerImpl.next(XMLDocumentScannerImpl.java:648) at com.sun.org.apache.xerces.internal.impl.XMLNSDocumentScannerImpl.next(XMLNSDocumentScannerImpl.java:140) at com.sun.org.apache.xerces.internal.impl.XMLDocumentFragmentScannerImpl.scanDocument(XMLDocumentFragmentScannerImpl.java:511) at com.sun.org.apache.xerces.internal.parsers.XML11Configuration.parse(XML11Configuration.java:808) at com.sun.org.apache.xerces.internal.parsers.XML11Configuration.parse(XML11Configuration.java:737) at com.sun.org.apache.xerces.internal.parsers.XMLParser.parse(XMLParser.java:119) at com.sun.org.apache.xerces.internal.parsers.AbstractSAXParser.parse(AbstractSAXParser.java:1205) at Thanks.

at com.sun.org.apache.xerces.internal.impl.io.UTF8Reader.invalidByte(Unknown Source) at com.sun.org.apache.xerces.internal.impl.io.UTF8Reader.read(Unknown Source) at com.sun.org.apache.xerces.internal.impl.XMLEntityScanner.load(Unknown Source) at com.sun.org.apache.xerces.internal.impl.XMLEntityScanner.scanLiteral(Unknown Source) at com.sun.org.apache.xerces.internal.impl.XMLScanner.scanAttributeValue(Unknown Source) at com.sun.org.apache.xerces.internal.impl.XMLNSDocumentScannerImpl.scanAttribute(Unknown Source) at com.sun.org.apache.xerces.internal.impl.XMLNSDocumentScannerImpl.scanStartElement(Unknown Source) at com.sun.org.apache.xerces.internal.impl.XMLDocumentFragmentScannerImpl$FragmentContentDriver.next(Unknown Source) at com.sun.org.apache.xerces.internal.impl.XMLDocumentScannerImpl.next(Unknown Source) at com.sun.org.apache.xerces.internal.impl.XMLNSDocumentScannerImpl.next(Unknown Source) at check my blog Embed Share Copy sharable URL for this gist. at org.dom4j.io.SAXReader.read(SAXReader.java:482) at org.dom4j.io.SAXReader.read(SAXReader.java:264) at hudson.tasks.junit.SuiteResult.parse(SuiteResult.java:112) at hudson.tasks.junit.TestResult.parse(TestResult.java:208) ... 15 more Caused by: org.xml.sax.SAXParseException: The character sequence "]]>" must not appear in content unless used to mark the end of a Take a tour to get the most out of Samebug.

Tired of useless tips?

It contains a lengthy error report. I also think that it seems to be the problem but, as far as I know, I can not change anything to make Hudson to generate the right XML for the If the > JUnit built in Hudson is used then this may be a Hudson issue. http://homecomputermarket.com/failed-to/failed-to-extract-required-files-from-archive-diablo-3-mac.html Hide Permalink Andrew Bayer added a comment - 2009/Dec/31 2:20 PM I could be wrong, but I have a feeling this is dependent on JENKINS-5048 - I remember the last time

at com.sun.org.apache.xerces.internal.util.ErrorHandlerWrapper.createSAXParseException(ErrorHandlerWrapper.java:195) at com.sun.org.apache.xerces.internal.util.ErrorHandlerWrapper.fatalError(ErrorHandlerWrapper.java:174) at com.sun.org.apache.xerces.internal.impl.XMLErrorReporter.reportError(XMLErrorReporter.java:388) at com.sun.org.apache.xerces.internal.impl.XMLScanner.reportFatalError(XMLScanner.java:1414) at com.sun.org.apache.xerces.internal.impl.XMLDocumentFragmentScannerImpl.scanContent(XMLDocumentFragmentScannerImpl.java:1618) at com.sun.org.apache.xerces.internal.impl.XMLDocumentFragmentScannerImpl$FragmentContentDriver.next(XMLDocumentFragmentScannerImpl.java:2902) at com.sun.org.apache.xerces.internal.impl.XMLDocumentScannerImpl.next(XMLDocumentScannerImpl.java:648) at com.sun.org.apache.xerces.internal.impl.XMLNSDocumentScannerImpl.next(XMLNSDocumentScannerImpl.java:140) at com.sun.org.apache.xerces.internal.impl.XMLDocumentFragmentScannerImpl.scanDocument(XMLDocumentFragmentScannerImpl.java:511) at com.sun.org.apache.xerces.internal.parsers.XML11Configuration.parse(XML11Configuration.java:808) at com.sun.org.apache.xerces.internal.parsers.XML11Configuration.parse(XML11Configuration.java:737) at com.sun.org.apache.xerces.internal.parsers.XMLParser.parse(XMLParser.java:119) at com.sun.org.apache.xerces.internal.parsers.AbstractSAXParser.parse(AbstractSAXParser.java:1205) at com.sun.org.apache.xerces.internal.jaxp.SAXParserImpl$JAXPSAXParser.parse(SAXParserImpl.java:522) at org.dom4j.io.SAXReader.read(SAXReader.java:465) ... Recording test results ERROR: Failed to archive test reports hudson.util.IOException2: Failed to read /data/hudson/.hudson/jobs/My Project/workspace/My Project/target/test-reports/TEST-my.project.MyTest.xml at hudson.util.IOException2.(IOException2.java:36) at hudson.tasks.junit.TestResult.parse(TestResult.java:187) at hudson.tasks.junit.TestResult.parse(TestResult.java:141) at hudson.tasks.junit.TestResult.(TestResult.java:104) at hudson.tasks.junit.JUnitParser$ParseResultCallable.invoke(JUnitParser.java:111) at hudson.tasks.junit.JUnitParser$ParseResultCallable.invoke(JUnitParser.java:83) at hudson.FilePath.act(FilePath.java:791) at GitHub | 4 years ago | dweiss hudson.util.IOException2: Failed to read /var/lib/jenkins/workspace/Lucene-Solr-trunk-Linux/solr/build/solr-core/test/TEST-org.apache.solr.cloud.BasicDistributedZk2Test.xml find similars Java RT dom4j Hudson 0 Speed up your debug routine!

Sign in to comment Contact GitHub API Training Shop Blog About © 2016 GitHub, Inc.

at org.apache.xerces.util.ErrorHandlerWrapper.createSAXParseException(Unknown Source) at org.apache.xerces.util.ErrorHandlerWrapper.fatalError(Unknown Source) at org.apache.xerces.impl.XMLErrorReporter.reportError(Unknown Source) at org.apache.xerces.impl.XMLErrorReporter.reportError(Unknown Source) at org.apache.xerces.impl.XMLScanner.reportFatalError(Unknown Source) at org.apache.xerces.impl.XMLDocumentScannerImpl$TrailingMiscDispatcher.dispatch(Unknown Source) at org.apache.xerces.impl.XMLDocumentFragmentScannerImpl.scanDocument(Unknown Source) at org.apache.xerces.parsers.XML11Configuration.parse(Unknown Source) at org.apache.xerces.parsers.XML11Configuration.parse(Unknown Source) at org.apache.xerces.parsers.XMLParser.parse(Unknown Source) at Error Message hudson 1.339 Recording test results ERROR: Failed to archive test reports hudson.util.IOException2: remote file operation failed at hudson.FilePath.act(FilePath.java:672) at hudson.FilePath.act(FilePath.java:660) at hudson.tasks.junit.JUnitResultArchiver.perform(JUnitResultArchiver.java:117) at hudson.tasks.BuildStepMonitor$1.perform(BuildStepMonitor.java:19) at hudson.model.AbstractBuild$AbstractRunner.perform(AbstractBuild.java:583) at hudson.model.AbstractBuild$AbstractRunner.performAllBuildStep(AbstractBuild.java:564) at Atlassian Google Grupları Tartışma Forumları'nı kullanmak için lütfen tarayıcı ayarlarınızda JavaScript'i etkinleştirin ve sonra bu sayfayı yenileyin. . If this is the same case, there will be an extra '>' character written after the end tag in the XML file.

Show Andrew Bayer added a comment - 2009/Dec/31 2:20 PM I could be wrong, but I have a feeling this is dependent on JENKINS-5048 - I remember the last time the Comment 6 Mariela 2013-07-24 07:34:16 EDT (In reply to comment #5) > Here's some more information from Winston: "The file is generated by JUnit. > The Hudson test archiver reads these I have this problem with Jenkins, when tries to archive tests. have a peek at these guys This is the file's content (used ....

I've included the full stack trace below, but it seems to relate to a missing resource bundle by com.sun.org.apache.xerces.internal.impl.msg.SAXMessages. at com.sun.org.apache.xerces.internal.util.ErrorHandlerWrapper.createSAXParseException(ErrorHandlerWrapper.java:195) at com.sun.org.apache.xerces.internal.util.ErrorHandlerWrapper.fatalError(ErrorHandlerWrapper.java:174) at com.sun.org.apache.xerces.internal.impl.XMLErrorReporter.reportError(XMLErrorReporter.java:388) at com.sun.org.apache.xerces.internal.impl.XMLScanner.reportFatalError(XMLScanner.java:1414) at com.sun.org.apache.xerces.internal.impl.XMLScanner.scanAttributeValue(XMLScanner.java:932) at com.sun.org.apache.xerces.internal.impl.XMLNSDocumentScannerImpl.scanAttribute(XMLNSDocumentScannerImpl.java:460) at com.sun.org.apache.xerces.internal.impl.XMLNSDocumentScannerImpl.scanStartElement(XMLNSDocumentScannerImpl.java:277) at com.sun.org.apache.xerces.internal.impl.XMLDocumentFragmentScannerImpl$FragmentContentDriver.next(XMLDocumentFragmentScannerImpl.java:2755) at com.sun.org.apache.xerces.internal.impl.XMLDocumentScannerImpl.next(XMLDocumentScannerImpl.java:648) at com.sun.org.apache.xerces.internal.impl.XMLNSDocumentScannerImpl.next(XMLNSDocumentScannerImpl.java:140) at com.sun.org.apache.xerces.internal.impl.XMLDocumentFragmentScannerImpl.scanDocument(XMLDocumentFragmentScannerImpl.java:511) at com.sun.org.apache.xerces.internal.parsers.XML11Configuration.parse(XML11Configuration.java:808) at com.sun.org.apache.xerces.internal.parsers.XML11Configuration.parse(XML11Configuration.java:737) at com.sun.org.apache.xerces.internal.parsers.XMLParser.parse(XMLParser.java:119) at com.sun.org.apache.xerces.internal.parsers.AbstractSAXParser.parse(AbstractSAXParser.java:1205) at It contains a lengthy error report. The stylesheet may be looping. ...

The stylesheet may be looping. ... But I'll do my best to share everything > possible to help on solving this. > > Thanks! Atlassian Skip to content Ignore Learn more Please note that GitHub no longer supports old versions of Firefox. Then we can > see what is being written there.

We recommend upgrading to the latest Safari, Google Chrome, or Firefox. All gists GitHub Sign up for a GitHub account Sign in Create a gist now Instantly share code, notes, Reload to refresh your session. The problem is still happening... Thanks.