Home > The Specified > Error 1 The Specified Module Could Not Be Found. (exception From Hresult 0x8007007e)

Error 1 The Specified Module Could Not Be Found. (exception From Hresult 0x8007007e)

Contents

But I can't figure out how to resolve this error when I try to run the web service. Not the answer you're looking for? How can I forget children toys riffs? Browse other questions tagged asp.net c++ web-services dll dependencies or ask your own question. http://homecomputermarket.com/the-specified/error-126-the-specified-module-could-not-be-found-windows-7.html

That means there are dlls that are not referenced in your project, but still expected to be present in the bin folder. –nunespascal Jun 25 '12 at 12:22 Copy A word for something that used to be unique but is now so commonplace it is no longer noticed I feel like my encounters are too easy, even using the encounter Regards, Dyyo - Microsoft Recommended ASP.NET Hosting ‹ Previous Thread|Next Thread › This site is managed for Microsoft by Neudesic, LLC. | © 2016 Microsoft. I added the dll folder to the system PATH and everything worked... https://forums.asp.net/t/1901963.aspx?The+specified+module+could+not+be+found+Exception+from+HRESULT+0x8007007E+

Error 1 The Specified Module Could Not Be Found. (exception From Hresult 0x8007007e)

Could you make me a hexagon please? How smart is the original Ridley Scott Xenomorph really? Ask a question Quick access Forums home Browse forums users FAQ Search related threads Remove From My Forums Answered by: The specified module could not be found. (Exception from HRESULT: 0x8007007E) Next time you get this error message, make efficient use of the process monitor to catch the culprit.

Tags .NET Comments (0) Cancel reply Name * Email * Website Skip to

Los errores se citan a continuación. Did Malcolm X say that Islam has shown him that a blanket indictment of all white people is wrong? Clone yourself! Citrix System.io.filenotfoundexception: The Specified Module Could Not Be Found The specified module could not be found. (Exception from HRESULT: 0x8007007E)3Error loading System.Management.Automation assembly3Prevent runtime assembly binding to older assemblies0Assembly error in Crystal ReportViewer in server machine0“Could not load file or

The native dll had a single “Hello” method which returned “Hello World” string.

#include "StdAfx.h" #include "TestObject.h" TestObject::TestObject() {} std::string TestObject::Hello() can some one please help to how to resolve this issue. There have also been a few occurrences where native assemblies were missing from the %systemroot%\system32 folder, such as msvcr71.dll. https://blogs.msdn.microsoft.com/dhrubach/2008/07/09/the-specified-module-could-not-be-found-hresult-0x800700e/ unique stamp per SSH login List all multiplicative partitions of n Need a better layout, so that blank space can be utilized I feel like my encounters are too easy, even

I got it resolved. 0x8007007e Windows 10 Next I collected process monitor trace and root cause was in front of me: w3wp.exe2012QueryOpenC:\WINNT\Microsoft.NET\Framework\v2.0.50727\Temporary ASP.NET Files\managedwrappersite\5bbb713b\7beac3fa\assembly\dl3\bfbeeb54\95e2dc78_66d5c801\UnmanagedTest.dllNAME NOT FOUND w3wp.exe2012QueryOpenC:\WINNT\system32\UnmanagedTest.dllNAME NOT FOUND w3wp.exe2012QueryOpenC:\WINNT\system\UnmanagedTest.dllNAME NOT FOUND w3wp.exe2012QueryOpenC:\WINNT\UnmanagedTest.dllNAME NOT The specified module could not be found. (Exception from HRESULT: 0x8007007E) up vote 0 down vote favorite 1 i have an .net application using visual studio 2005, when i try to What the heck is going on here??

The Specified Module Could Not Be Found Exception From Hresult 0x8007007e In C#

Expand the General settings, set Enable 32-bit Applications to True, and click OK. I found a copy of msvc71.dll on my dev machine (Sql Server had it) and dropped it on the virtual box's system32. Error 1 The Specified Module Could Not Be Found. (exception From Hresult 0x8007007e) more hot questions question feed lang-cpp about us tour help blog chat data legal privacy policy work here advertising info mobile contact us feedback Technology Life / Arts Culture / Recreation Asp.net The Specified Module Could Not Be Found. (exception From Hresult: 0x8007007e) Stack Trace: [FileNotFoundException: The specified module could not be found. (Exception from HRESULT: 0x8007007E)] System.Reflection.Assembly._nLoad(AssemblyName fileName, String codeBase, Evidence assemblySecurity, Assembly locationHint, StackCrawlMark& stackMark, Boolean throwOnFileNotFound, Boolean forIntrospection) +0 System.Reflection.Assembly.nLoad(AssemblyName fileName,

Clone yourself! this contact form Let’s get down to business and find that out. Just read through the logs (filter them as much as possible!) until you find the FNFs that don't ever get found. –Will Apr 1 '12 at 19:20 2 I've blogged Browse other questions tagged asp.net dll or ask your own question. The Specified Module Could Not Be Found Exception From Hresult Vmware

However, this one is behaving differently. One of the apps, which runs on asp.net v2.0 using forms authentication will not load. Have a close look into theprobing paths of the dll :these paths are multiple values of the "PATH" environement variable on the server.Why doesw3wp.exe look for a native dll in these have a peek here How can I forget children toys riffs?

iPhone SE powers on whenever moved, defective? Msvcr71.dll Windows 7 What is a good method for planting Ball and Burlap trees? The specified module could not be found. (Exception from HRESULT: 0x8007007E) [Answered]RSS 2 replies Last post Apr 30, 2013 10:30 PM by dyyo ‹ Previous Thread|Next Thread › Print Share Twitter

How to politely decline a postdoc job offer after signing the offer letter?

Managed Exception : System.IO.FileNotFoundException: The specified module could not be found. (Exception from HRESULT: 0x8007007E)

Partial Stack Trace of the failing thread: [FileNotFoundException: The specified module could not be What's the purpose of the same page tool? Friday, January 22, 2010 8:29 PM 0 Sign in to vote hi, can please tesll me which was that dll missing? An Attempt Was Made To Load A Program With An Incorrect Format. (exception From Hresult: 0x8007000b) Here is a log (and the xsl sheet) from a failed request...

If this unmanaged dll is yours and inside the same solution, it's can be simple to compile in 32bit, Build->Configuration Manager. Coup: Can you assassinate yourself? Do you have all of their dependencies available? –Rup Jun 25 '12 at 12:10 You are loading dlls by reflection. Check This Out What does this bus signal representation mean Victorian Ship Weighing How can I convince players not to offload a seemingly useless weapon?

Error : The specified module could not be found. (Exception from HRESULT: 0x8007007E) Description: An unhandled exception occurred during the execution of the current web request.